{"text_format":"1","workbook":"xlsx","n_sheets":16,"sheets":["Unit Conversion Sheet","Instructions","Main Menu","Start Page","Summary","AWWA-Water Balance Data Transf.","Performance Indicator Charts","Real Losses Component Analysis","Real Loss Components Chart","Failure Frequency Analysis","A-L-R Times Options","Economic Intervention Frequency","Pressure Management Options","Glossary","License","Data 2012"],"not_rendered":{"charts":5,"images":31,"macros":1,"external_links":0,"defined_names":13,"comments":0,"pivot_tables":0},"unopened":[],"bounds":{"document_bytes":16777216,"sheet_cells":100000,"rows_first":2000,"rows_last":500,"rows_between":2000,"halvings":0,"cell_chars":16384,"cell_head_chars":4096},"cells_cut":0,"cells_raw":0,"read":"whole","date_system":"1900"}

{"sheet":"Unit Conversion Sheet","index":0,"n_rows":79,"n_cols":16,"rows_kept":79,"cut":false,"hidden":true,"merged":[[7,2,7,4]]}
[]
[]
[null,"gallons / cubic foot",7.4805194500000001]
[null,"sq feet / acre",43560]
[null,"litres / gallon",3.7854117999999999]
[null,"gallons / litre",{"$f":"1/C5","v":0.26417205124155846}]
{"$rows_left_out":74}
{"sheet":"Instructions","index":1,"n_rows":101,"n_cols":2,"rows_kept":101,"cut":false,"hidden":false,"merged":[[38,1,38,9],[39,1,39,9],[40,1,40,9],[49,1,49,9],[50,1,50,9],[46,1,46,9],[47,1,47,9],[48,1,48,9],[41,1,41,9],[33,1,33,9],[34,1,34,9],[35,1,35,9],[36,1,36,9],[37,1,37,9],[28,1,28,9],[29,1,29,9],[30,1,30,9],[31,1,31,9],[32,1,32,9],[22,0,22,9],[9,0,9,9],[10,0,10,9],[7,0,7,9],[2,0,2,16383],[51,1,51,9],[23,0,23,9],[4,0,6,9],[8,0,8,9],[21,0,21,9],[13,0,13,9],[20,0,20,9],[14,1,14,9],[15,1,15,9],[16,1,16,9],[17,1,17,9],[18,1,18,9],[19,1,19,9],[12,0,12,9],[44,1,44,9],[45,1,45,9],[77,1,77,9],[66,1,66,9],[67,1,67,9],[98,0,98,9],[92,0,92,9],[80,0,80,9],[86,0,86,9],[79,0,79,9],[82,0,82,9],[81,0,81,9],[84,0,84,9],[75,1,75,9],[76,1,76,16383],[73,1,73,9],[78,1,78,9],[74,0,74,9],[60,0,60,9],[68,1,68,9],[69,1,69,9],[71,1,71,9],[72,1,72,9],[62,0,62,9],[61,0,61,9],[65,0,65,9],[99,0,99,9],[100,0,100,9],[87,0,87,9],[91,0,91,9],[97,0,97,9],[88,0,88,9],[94,1,94,9],[96,0,96,9],[95,0,95,9],[93,1,93,9],[90,0,90,9],[89,0,89,9],[59,1,59,9],[63,0,63,9],[27,0,27,9],[64,0,64,9],[0,0,1,8],[52,1,52,9],[53,1,53,9],[56,1,56,9],[57,1,57,9],[58,1,58,9],[24,0,24,9],[54,1,54,9],[43,0,43,9],[55,1,55,9],[25,0,25,9],[26,0,26,9]]}
["WaterRF 4372: Real Loss Component Analysis: A Tool for Economic Water Loss Control"]
[]
[{"$f":"IF('Start Page'!$Y$37=\"\",\"\",IF('Start Page'!$K$37=\"Partial Audit Period\",\"Water Audit: \"&'Start Page'!$D$26&\", \"&'Start Page'!$H$26&\", \"&'Start Page'!$K$26&\", \"&'Start Page'!$Y$37,\"Water Audit: \"&'Start Page'!$D$26&\", \"&'Start Page'!$H$26&\", \"&'Start Page'!$K$26&\", \"&YEAR('Start Page'!$Y$37)))","v":""}]
["INSTRUCTIONS"]
["Welcome to the WaterRF 4372 Component Analysis of Real Losses Software Model.  These instructions will provide a basic summary of each tab in this model.   Instructions are also available on each tab.  This spreadsheet based \"Model\" was designed to provide North American (NA) water utilities with a utility-tested software tool to undertake a leakage component analysis and to identify economic options for real loss reduction through improved speed and quality of leak repair, proactive leak detection and pressure management. This Model was also designed to assist NA water utilities in evaluating options for implementing efficient and sustainable leakage control programs. The models results should only be seen as a preliminary starting point for proactive management of Real Losses. The preliminary Real Loss control strategy needs to be refined as more results become available. \n\nIt is important to acknowledge that the Model is only as useful and instructive as the quality of the user’s data inputs. Throughout the instructions provided in the Model (and throughout the WaterRF 4372 report), there is particular emphasis on the importance of data quality and validation.\n\nFurthermore, it is important to highlight that the Model requires a significant amount of validated data and its \"outputs\" are meant to provide opportunities to test scenarios but do not represent concrete goals or hard and fast targets. The Model is a dynamic tool meant for guidance and not a mechanism for direct reporting like the AWWA Free Water Audit Software, or for regulatory target setting."]
[]
{"$rows_left_out":96}
{"sheet":"Main Menu","index":2,"n_rows":57,"n_cols":11,"rows_kept":57,"cut":false,"hidden":false,"merged":[[56,1,56,2],[38,4,39,9],[23,4,24,9],[47,4,48,9],[44,4,45,9],[41,4,42,9],[35,4,36,9],[32,4,33,9],[29,4,30,9],[26,4,27,9],[11,1,12,9],[13,1,13,10],[50,4,51,9],[53,4,54,9],[15,1,15,10],[20,4,21,9],[17,4,18,9]]}
[]
[]
[]
[]
[]
[]
{"$rows_left_out":52}
{"sheet":"Start Page","index":3,"n_rows":60,"n_cols":25,"rows_kept":60,"cut":false,"hidden":false,"merged":[[28,7,28,8],[0,1,1,13],[2,1,2,18],[43,3,48,13],[50,3,56,13],[4,1,4,16383],[5,2,7,15],[9,2,10,15],[36,10,36,11],[41,10,41,17],[25,3,25,5],[25,7,25,8],[25,10,25,11],[30,10,30,13],[32,10,32,13],[28,3,28,5],[28,10,28,11]]}
[null,"WaterRF 4372: Real Loss Component Analysis: A Tool for Economic Water Loss Control"]
[]
[null,{"$f":"IF($Y$37=\"\",\"\",IF($K$37=\"Partial Audit Period\",\"Water Audit: \"&$D$26&\", \"&$H$26&\", \"&$K$26&\", \"&$Y$37,\"Water Audit: \"&$D$26&\", \"&$H$26&\", \"&$K$26&\", \"&YEAR($Y$37)))","v":""}]
[null,"START PAGE"]
[null,"Macros must be enabled to properly use the WaterRF 4372 Component Analysis Modeling Software"]
[null,"PURPOSE: ","This spreadsheet based \"Model\" was designed to provide North American (NA) water utilities with a utility-tested software tool to undertake a leakage component analysis and to identify economic options for real loss reduction through improved speed and quality of leak repair, proactive leak detection and pressure management. This Model was also designed to assist NA water utilities in evaluating options for implementing efficient and sustainable leakage control programs. The models results should only be seen as a preliminary starting point for proactive management of Real Losses. The preliminary Real Loss control strategy needs to be refined as more results become available. "]
{"$rows_left_out":55}
{"sheet":"Summary","index":4,"n_rows":57,"n_cols":7,"rows_kept":57,"cut":false,"hidden":false,"merged":[[8,1,8,2],[9,1,9,2],[10,1,10,2],[11,1,11,2],[12,1,12,2],[56,0,56,1],[22,1,22,2],[25,1,25,5],[37,1,37,2],[41,1,41,3],[42,1,42,3],[52,1,52,3],[53,1,53,3],[47,1,47,3],[48,1,48,3],[49,1,49,3],[45,1,45,3],[43,1,43,3],[46,1,46,3],[0,0,1,5],[21,1,21,2],[32,1,32,4],[33,1,33,4],[38,1,38,2],[36,1,36,2],[18,1,18,2],[19,1,19,2],[16,1,16,2],[20,1,20,2],[2,0,2,6],[17,1,17,2],[5,1,5,5],[13,1,13,2],[14,1,14,2],[15,1,15,2]]}
["WaterRF 4372: Real Loss Component Analysis: A Tool for Economic Water Loss Control"]
[]
[{"$f":"IF('Start Page'!$Y$37=\"\",\"\",IF('Start Page'!$K$37=\"Partial Audit Period\",\"Water Audit: \"&'Start Page'!$D$26&\", \"&'Start Page'!$H$26&\", \"&'Start Page'!$K$26&\", \"&'Start Page'!$Y$37,\"Water Audit: \"&'Start Page'!$D$26&\", \"&'Start Page'!$H$26&\", \"&'Start Page'!$K$26&\", \"&YEAR('Start Page'!$Y$37)))","v":""}]
["WaterRF 4372 COMPONENT ANALYSIS MODEL SUMMARY"]
[]
[null,"As the input data is filled into the model, this sheet will populate with the results and recommendations from the Real Losses Component Analysis, A-L-R Times, Economic Intervention and Pressure Management tabs.  The performance indicators from the AWWA Free Water Audit Software have been added to show a brief review of the performance of the system being analyzed"]
{"$rows_left_out":52}
{"sheet":"AWWA-Water Balance Data Transf.","index":5,"n_rows":74,"n_cols":29,"rows_kept":74,"cut":false,"hidden":false,"merged":[[2,1,2,10],[21,1,21,2],[16,1,16,2],[9,1,9,2],[10,1,10,2],[11,1,11,2],[12,1,12,2],[13,1,13,2],[14,1,14,2],[15,1,15,2],[17,1,17,2],[18,1,18,2],[19,1,19,2],[20,1,20,2],[21,5,22,10],[22,1,22,2],[36,1,36,2],[37,1,37,2],[38,1,38,2],[39,1,39,2],[23,1,23,2],[24,1,24,2],[25,1,25,2],[26,1,26,2],[27,1,27,2],[31,1,31,2],[32,1,32,2],[33,1,33,2],[34,1,34,2],[35,1,35,2],[28,1,28,2],[60,1,60,2],[61,1,61,2],[62,1,62,2],[63,1,63,2],[47,1,47,2],[48,1,48,2],[49,1,49,2],[50,1,50,2],[51,1,51,2],[40,1,40,2],[29,1,29,2],[30,1,30,2],[68,3,70,8],[65,1,65,2],[66,1,66,2],[68,1,68,2],[69,1,69,2],[64,1,64,2],[53,1,53,2],[54,1,54,2],[55,1,55,2],[56,1,56,2],[57,1,57,2],[58,1,58,2],[59,1,59,2],[0,1,1,4],[27,5,28,8],[25,5,26,9],[66,3,67,9],[60,5,62,10],[41,3,42,8],[63,3,64,9],[52,1,52,2],[41,1,41,2],[42,1,42,2],[43,1,43,2],[44,1,44,2],[45,1,45,2],[46,1,46,2],[29,5,30,8],[31,5,32,9]]}
[null,"WaterRF 4372: Real Loss Component Analysis: A Tool for Economic Water Loss Control"]
[]
[null,{"$f":"IF('Start Page'!$Y$37=\"\",\"\",IF('Start Page'!$K$37=\"Partial Audit Period\",\"Water Audit: \"&'Start Page'!$D$26&\", \"&'Start Page'!$H$26&\", \"&'Start Page'!$K$26&\", \"&'Start Page'!$Y$37,\"Water Audit: \"&'Start Page'!$D$26&\", \"&'Start Page'!$H$26&\", \"&'Start Page'!$K$26&\", \"&YEAR('Start Page'!$Y$37)))","v":""}]
[null,"AWWA - WATER BALANCE DATA TRANSFER"]
[]
[null,"Instructions: ","Please enter the data in the blue cells below based on the AWWA WLCC Free Water Audit Software: Reporting Sheet."]
{"$rows_left_out":69}
{"sheet":"Performance Indicator Charts","index":6,"n_rows":339,"n_cols":29,"rows_kept":339,"cut":false,"hidden":false,"merged":[[5,2,5,9],[9,1,10,1],[86,3,86,5],[87,3,87,5],[61,3,61,5],[80,3,80,5],[81,3,81,5],[82,3,82,5],[83,3,83,5],[84,3,84,5],[85,3,85,5],[74,3,74,5],[75,3,75,5],[76,3,76,5],[77,3,77,5],[0,1,1,7],[78,3,78,5],[79,3,79,5],[73,3,73,5],[67,3,67,5],[62,3,62,5],[63,3,63,5],[64,3,64,5],[65,3,65,5],[66,3,66,5],[68,3,68,5],[69,3,69,5],[70,3,70,5],[71,3,71,5],[72,3,72,5],[2,1,2,9]]}
[null,"WaterRF 4372: Real Loss Component Analysis: A Tool for Economic Water Loss Control"]
[]
[null,{"$f":"IF('Start Page'!$Y$37=\"\",\"\",IF('Start Page'!$K$37=\"Partial Audit Period\",\"Water Audit: \"&'Start Page'!$D$26&\", \"&'Start Page'!$H$26&\", \"&'Start Page'!$K$26&\", \"&'Start Page'!$Y$37,\"Water Audit: \"&'Start Page'!$D$26&\", \"&'Start Page'!$H$26&\", \"&'Start Page'!$K$26&\", \"&YEAR('Start Page'!$Y$37)))","v":""}]
[null,"PERFORMANCE INDICATOR COMPARISON"]
[]
[null,"Instructions:","Please select a performance indicator from the drop-down box to compare your utility's performance against the AWWA North American Validated Water Audit Data for 2012*. The performance indicator graph also displays the 25th, 50th and 75th percentile of the performance indicators data set."]
{"$rows_left_out":334}
{"sheet":"Real Losses Component Analysis","index":7,"n_rows":179,"n_cols":36,"rows_kept":179,"cut":false,"hidden":false,"merged":[[2,1,2,17],[33,2,33,17],[3,1,3,5],[109,1,109,4],[88,15,88,16],[76,15,76,16],[54,3,55,3],[82,2,83,2],[82,3,83,3],[82,6,83,6],[82,7,83,7],[82,12,83,12],[82,13,83,13],[82,16,84,16],[82,15,84,15],[60,9,60,10],[66,9,66,10],[76,9,76,10],[74,9,74,10],[75,9,75,10],[80,2,80,17],[94,2,95,2],[36,7,37,7],[54,2,55,2],[16,6,17,15],[31,1,31,7],[105,1,105,5],[94,3,95,3],[94,6,95,6],[94,7,95,7],[94,8,94,11],[8,1,8,5],[67,9,67,10],[85,9,85,10],[86,9,86,10],[87,9,87,10],[88,9,88,10],[83,9,83,10],[84,9,84,10],[41,1,41,7],[28,1,28,5],[16,1,16,4],[15,1,15,4],[36,5,37,5],[90,1,90,5],[54,7,55,7],[54,6,55,6],[21,2,21,17],[141,12,142,12],[141,13,142,13],[153,13,154,13],[153,12,154,12],[153,2,154,2],[153,3,154,3],[153,7,154,7],[154,9,154,10],[65,9,65,10],[114,9,114,10],[95,9,95,10],[96,9,96,10],[97,9,97,10],[98,9,98,10],[113,2,114,2],[113,3,114,3],[113,6,114,6],[113,7,114,7],[113,12,114,12],[125,9,125,10],[126,9,126,10],[127,9,127,10],[128,9,128,10],[135,9,135,10],[36,11,36,17],[92,2,92,17],[35,7,35,8],[54,8,54,11],[56,9,56,10],[46,1,46,4],[57,9,57,10],[58,9,58,10],[59,9,59,10],[55,9,55,10],[54,12,55,12],[54,13,55,13],[48,2,48,17],[52,2,52,17],[54,16,56,16],[54,15,56,15],[50,1,50,5],[71,9,71,10],[157,9,157,10],[142,9,142,10],[143,9,143,10],[144,9,144,10],[145,9,145,10],[146,9,146,10],[147,9,147,10],[155,9,155,10],[156,9,156,10],[153,8,153,11],[153,6,154,6],[94,13,95,13],[94,12,95,12],[116,9,116,10],[130,9,130,10],[131,9,131,10],[132,9,132,10],[115,9,115,10],[113,8,113,11],[141,7,142,7],[104,1,104,17],[149,1,149,4],[117,9,117,10],[141,6,142,6],[122,9,122,10],[123,9,123,10],[141,8,141,11],[133,9,133,10],[129,9,129,10],[141,2,142,2],[141,3,142,3],[137,1,137,7],[120,9,120,10],[121,9,121,10],[141,35,142,35],[118,9,118,10],[119,9,119,10],[134,9,134,10],[54,33,55,33],[54,34,55,34],[54,35,55,35],[54,27,55,27],[82,33,83,33],[82,34,83,34],[82,35,83,35],[94,33,95,33],[94,34,95,34],[94,35,95,35],[54,28,55,28],[54,29,55,31],[80,27,83,27],[94,27,95,27],[81,28,83,28],[81,29,83,31],[94,28,96,28],[94,29,96,31],[124,9,124,10],[113,13,114,13],[113,34,114,34],[72,9,72,10],[73,9,73,10],[64,9,64,10],[153,33,154,33],[153,34,154,34],[153,35,154,35],[135,15,135,16],[147,15,147,16],[113,33,114,33],[153,15,155,15],[153,16,155,16],[113,27,114,27],[140,27,142,27],[152,27,154,27],[113,28,114,28],[113,29,114,31],[140,28,142,28],[140,29,142,31],[153,28,155,28],[153,29,155,31],[113,35,114,35],[141,33,142,33],[141,34,142,34],[161,1,178,1],[0,1,1,10],[160,2,176,16],[43,15,45,16],[9,7,10,12],[78,1,78,6],[5,1,5,5],[107,2,107,17],[111,2,111,17],[139,2,139,17],[151,2,151,17],[94,15,96,15],[94,16,96,16],[113,15,115,15],[113,16,115,16],[141,15,143,15],[141,16,143,16],[82,8,82,11],[61,9,61,10],[62,9,62,10],[63,9,63,10],[68,9,68,10],[69,9,69,10],[70,9,70,10]]}
[null,"WaterRF 4372: Real Loss Component Analysis: A Tool for Economic Water Loss Control"]
[]
[null,{"$f":"IF('Start Page'!$Y$37=\"\",\"\",IF('Start Page'!$K$37=\"Partial Audit Period\",\"Water Audit: \"&'Start Page'!$D$26&\", \"&'Start Page'!$H$26&\", \"&'Start Page'!$K$26&\", \"&'Start Page'!$Y$37,\"Water Audit: \"&'Start Page'!$D$26&\", \"&'Start Page'!$H$26&\", \"&'Start Page'!$K$26&\", \"&YEAR('Start Page'!$Y$37)))","v":""}]
[null,"REAL LOSSES COMPONENT ANALYSIS"]
[]
[null,"SUMMARY: REAL LOSS COMPONENT ANALYSIS"]
{"$rows_left_out":174}
{"sheet":"Real Loss Components Chart","index":8,"n_rows":35,"n_cols":26,"rows_kept":35,"cut":false,"hidden":false,"merged":[[0,1,1,15],[2,1,2,16]]}
[null,"WaterRF 4372: Real Loss Component Analysis: A Tool for Economic Water Loss Control"]
[]
[null,{"$f":"IF('Start Page'!$Y$37=\"\",\"\",IF('Start Page'!$K$37=\"Partial Audit Period\",\"Water Audit: \"&'Start Page'!$D$26&\", \"&'Start Page'!$H$26&\", \"&'Start Page'!$K$26&\", \"&'Start Page'!$Y$37,\"Water Audit: \"&'Start Page'!$D$26&\", \"&'Start Page'!$H$26&\", \"&'Start Page'!$K$26&\", \"&YEAR('Start Page'!$Y$37)))","v":""}]
[null,"REAL LOSSES COMPONENTS CHART"]
[]
[]
{"$rows_left_out":30}
{"sheet":"Failure Frequency Analysis","index":9,"n_rows":32,"n_cols":23,"rows_kept":32,"cut":false,"hidden":false,"merged":[[13,21,13,25],[2,1,2,3],[0,1,1,6]]}
[null,"WaterRF 4372: Real Loss Component Analysis: A Tool for Economic Water Loss Control"]
[]
[null,{"$f":"IF('Start Page'!$Y$37=\"\",\"\",IF('Start Page'!$K$37=\"Partial Audit Period\",\"Water Audit: \"&'Start Page'!$D$26&\", \"&'Start Page'!$H$26&\", \"&'Start Page'!$K$26&\", \"&'Start Page'!$Y$37,\"Water Audit: \"&'Start Page'!$D$26&\", \"&'Start Page'!$H$26&\", \"&'Start Page'!$K$26&\", \"&YEAR('Start Page'!$Y$37)))","v":""}]
[null,"INFRASTRUCTURE FAILURE FREQUENCY ANALYSIS"]
[]
[null,{"$f":"V6","v":""},null,null,null,null,{"$f":"B6","v":""},null,null,null,null,null,null,null,null,null,null,null,null,null,null,{"$f":"'Start Page'!Y21","v":""}]
{"$rows_left_out":27}
{"sheet":"A-L-R Times Options","index":10,"n_rows":52,"n_cols":8,"rows_kept":52,"cut":false,"hidden":false,"merged":[[51,1,51,2],[24,2,24,3],[25,2,25,3],[26,2,26,3],[27,2,27,3],[50,2,50,3],[48,2,48,3],[49,2,49,3],[28,2,28,3],[29,2,29,3],[33,2,33,3],[32,2,32,3],[34,2,34,3],[35,2,35,3],[36,2,36,3],[47,2,47,3],[0,1,1,6],[9,3,12,7],[43,2,43,3],[17,2,17,3],[18,2,18,3],[19,2,19,3],[20,2,20,3],[21,2,21,3],[2,1,2,7],[37,2,37,3],[38,2,38,3],[39,2,39,3],[40,2,40,3],[41,2,41,3],[45,2,45,3],[46,2,46,3],[22,2,22,3],[23,2,23,3],[30,2,30,3],[31,2,31,3],[44,2,44,3],[42,2,42,3]]}
[null,"WaterRF 4372: Real Loss Component Analysis: A Tool for Economic Water Loss Control"]
[]
[null,{"$f":"IF('Start Page'!$Y$37=\"\",\"\",IF('Start Page'!$K$37=\"Partial Audit Period\",\"Water Audit: \"&'Start Page'!$D$26&\", \"&'Start Page'!$H$26&\", \"&'Start Page'!$K$26&\", \"&'Start Page'!$Y$37,\"Water Audit: \"&'Start Page'!$D$26&\", \"&'Start Page'!$H$26&\", \"&'Start Page'!$K$26&\", \"&YEAR('Start Page'!$Y$37)))","v":""}]
[null,"EVALUATION OF LOCATION AND REPAIR TIME REDUCTION OPTIONS"]
[]
[]
{"$rows_left_out":47}
{"sheet":"Economic Intervention Frequency","index":11,"n_rows":48,"n_cols":27,"rows_kept":48,"cut":false,"hidden":false,"merged":[[2,1,2,14],[0,1,1,7],[5,7,19,13]]}
[null,"WaterRF 4372: Real Loss Component Analysis: A Tool for Economic Water Loss Control"]
[]
[null,{"$f":"IF('Start Page'!$Y$37=\"\",\"\",IF('Start Page'!$K$37=\"Partial Audit Period\",\"Water Audit: \"&'Start Page'!$D$26&\", \"&'Start Page'!$H$26&\", \"&'Start Page'!$K$26&\", \"&'Start Page'!$Y$37,\"Water Audit: \"&'Start Page'!$D$26&\", \"&'Start Page'!$H$26&\", \"&'Start Page'!$K$26&\", \"&YEAR('Start Page'!$Y$37)))","v":""}]
[null,"CALCULATION OF ECONOMIC INTERVENTION FREQUENCY FOR PROACTIVE LEAK DETECTION"]
[]
[null,null,"System Characteristics",null,null,null,null,"Instructions: Use this sheet to establish a preliminary schedule for proactive leak detection surveys and the corresponding necessary budget. Once the results from consecutive leak surveys are available, the Rate of Rise of Unreported Leakage should be updated and the proactive leak detection schedule should be refined taking into consideration these findings. \n\nIn order to establish a preliminary schedule for proactive leak detection or to review the currently utilized proactive leak detection schedule enter the cost for undertaking proactive leak detection ($/mile or $/km) in cell D31. Next enter the Average Rate of Rise of Unreported Leakage in cell D34. The Average Rate of Rise of Unreported Leakage is the rate at which leakage increases with time. The rate of rise is not necessarily linear since it can quickly change due to seasonal effects and other system specific impacts. The AWWA M36 Manual recommends assessing The Average Rate of Rise of Unreported Leakage either by comparing water balance results of several consecutive years and calculating the Average Rate of Rise of Unreported Leakage based on the increase in Real Loss volume from year to year (if utility does not employ proactive leak detection), or by analysis of District Metered Area night flow data or repair records of leaks detected through proactive leak detection (if utility employs proactive leakage control). Further details about how to assess the Average Rate of Rise of Unreported Leakage are provided in the AWWA M36 Manual. Note: kgal = 1,000 gallons. \n\nPlease note that the calculations used to determine the Economic Intervention Frequency are not best fit for systems with Infrastructure Leakage Index values that approach 1. For such systems, it is advised to review the Economic Intervention Frequency and associated costs with caution. "]
{"$rows_left_out":43}
{"sheet":"Pressure Management Options","index":12,"n_rows":49,"n_cols":22,"rows_kept":49,"cut":false,"hidden":false,"merged":[[0,1,1,2],[5,20,5,24],[20,2,21,3],[6,2,12,4],[38,2,47,6],[2,1,2,6]]}
[null,"WaterRF 4372: Real Loss Component Analysis: A Tool for Economic Water Loss Control"]
[]
[null,{"$f":"IF('Start Page'!$Y$37=\"\",\"\",IF('Start Page'!$K$37=\"Partial Audit Period\",\"Water Audit: \"&'Start Page'!$D$26&\", \"&'Start Page'!$H$26&\", \"&'Start Page'!$K$26&\", \"&'Start Page'!$Y$37,\"Water Audit: \"&'Start Page'!$D$26&\", \"&'Start Page'!$H$26&\", \"&'Start Page'!$K$26&\", \"&YEAR('Start Page'!$Y$37)))","v":""}]
[null,"EVALUATION OF PRESSURE MANAGEMENT OPPORTUNITIES"]
[]
[null,"Instructions:","This sheet was designed to provide a simple way to simulate various scenarios of pressure reduction and the resulting savings in real losses.",null,null,null,null,null,null,null,null,null,null,null,null,null,null,null,null,null,"Failure Frequency for Optimized Distribution Systems (Friedman 2010)"]
{"$rows_left_out":44}
{"sheet":"Glossary","index":13,"n_rows":150,"n_cols":11,"rows_kept":150,"cut":false,"hidden":false,"merged":[[126,0,127,0],[2,1,2,10],[35,3,36,3],[35,2,36,2],[35,0,36,0],[35,4,36,4],[0,1,1,4],[149,1,149,2],[126,2,127,2],[126,3,127,3],[126,4,127,4]]}
[null,"WaterRF 4372: Real Loss Component Analysis: A Tool for Economic Water Loss Control"]
[]
[null,{"$f":"IF('Start Page'!$Y$37=\"\",\"\",IF('Start Page'!$K$37=\"Partial Audit Period\",\"Water Audit: \"&'Start Page'!$D$26&\", \"&'Start Page'!$H$26&\", \"&'Start Page'!$K$26&\", \"&'Start Page'!$Y$37,\"Water Audit: \"&'Start Page'!$D$26&\", \"&'Start Page'!$H$26&\", \"&'Start Page'!$K$26&\", \"&YEAR('Start Page'!$Y$37)))","v":""}]
[null,"GLOSSARY"]
[]
[]
{"$rows_left_out":145}
{"sheet":"License","index":14,"n_rows":11,"n_cols":7,"rows_kept":11,"cut":false,"hidden":false,"merged":[[7,0,9,5],[4,0,6,6],[0,0,1,6]]}
["WaterRF 4372: Real Loss Component Analysis: A Tool for Economic Water Loss Control"]
[]
[{"$f":"IF('Start Page'!$Y$37=\"\",\"\",IF('Start Page'!$K$37=\"Partial Audit Period\",\"Water Audit: \"&'Start Page'!$D$26&\", \"&'Start Page'!$H$26&\", \"&'Start Page'!$K$26&\", \"&'Start Page'!$Y$37,\"Water Audit: \"&'Start Page'!$D$26&\", \"&'Start Page'!$H$26&\", \"&'Start Page'!$K$26&\", \"&YEAR('Start Page'!$Y$37)))","v":""}]
["LICENSE"]
["WaterRF 4372 Component Analysis of Real Losses Model developed by Water Systems Optimization, Inc for the Water Research Foundation and US EPA. December 2013"]
[]
{"$rows_left_out":6}
{"sheet":"Data 2012","index":15,"n_rows":82,"n_cols":29,"rows_kept":82,"cut":false,"hidden":true,"merged":[[62,1,79,1],[37,1,41,1],[42,1,45,1],[47,1,47,2],[48,1,51,1],[52,1,57,1],[58,1,61,1],[28,1,35,1],[2,1,2,2],[4,1,13,1],[15,1,15,2],[16,1,21,1],[22,1,27,1]]}
[]
[]
[null,"2012 Validated Water Audit Data\nAWWA Water Loss Control Committee\nCopyright © 2012, American Water Works Association. All Rights Reserved"]
[null,"Contact Information","Name of City or Utility","Greater Cincinnati Water Works","City of Santa Monica","ALBUQUERQUE BERNALILLO COUNTY WATER UTILITY","Aqua WSC","Austin Water Utility","City of Belmont","Birmingham Water Works Board","The City of Calgary","Cherokee County Water & Sewerage Authority","Cobb County Water System WSID 67003","City of Cranbrook, BC","Dalton Utilities","DC Water & Sewer Authority","Halifax Regional Water Commission","Water District No. 1 of Johnson County","Las Vegas Valley Water District","Louisville Water Company ","Orange County Utilities Department","PAWC-Pittsburgh","Philadelphia Water Department","City of Rio Rancho","Utilities Inc.","City of Wauwatosa Water Utility","Washington County Service Authority","City of Wilmington, Delaware","Water & Wastewater Authority of Wilson County"]
[null,"Administrative","Name of City or Utility","Cincinnati OH","Santa Montica CA","Albuquerque NM","Aqua TX","Austin TX","Belmont NC","Birmingham AL","Calgary CAN","Cherokee Co GA","Cobb Co GA","Cranbrook BC","Dalton GA","DC WSA","Halifax CAN","Johnson Co KS","Las Vegas NV","Louisville KY","Orange Co FL","PAWC-Pittsburgh PA","Philadelphia PA","Rio Rancho NM","Lexington SC","Wauwatosa WI","Washington Co VA","Wilmington DE","Wilson Co TN"]
[null,null,"Abbreviation","GCWW","SMW","ABCWUA","AquaWSC","AW","BUD","BWWB","CW","CCWSA","CCWS","CBW","DUTIL","DCWATER","HRWC","JCW1","LVVWD","LWCKY","OCFL","PAW","PWD","RRW","UI","WWU","WCSA","WDPW","WWAWC"]
{"$rows_left_out":76}